BDBM531232 US11208399, Example 7
SMILES CC(C)N1CCCC(C1)Nc1ccc(nn1)-c1c(C)cc(cc1O)C(F)(F)F
InChI Key InChIKey=QTTMNOYBKBYTIE-UHFFFAOYSA-N
Data  2 IC50
  Tab Delimited (TSV)   2D SDfile   Computed 3D by Vconf -m prep SDfile
Find this compound or compounds like it in BindingDB:
Activity Spreadsheet -- Enzyme Inhibition Constant Data from BindingDB
Found 1 hit for monomerid = 531232
TargetTumor necrosis factor(Homo sapiens (Human))
Novartis
US Patent
LigandPNGBDBM531232(US11208399, Example 7)
Affinity DataIC50: >1.00E+5nM. Assay description: Monocytic THP-1 cells were maintained according to providers' instructions in RPMI media as described above. Undifferentiated cells were plated a...
Ligand InfoPC cidPC sid
In DepthDetails US Patent